{"text_format":"1","workbook":"xlsx","n_sheets":7,"sheets":["Титульный лист","Таблица наблюдений","Список птиц","Регионы","Страны","Погода","Биотопы"],"not_rendered":{"charts":0,"images":0,"macros":1,"external_links":0,"defined_names":13,"comments":0,"pivot_tables":0},"unopened":[],"bounds":{"document_bytes":16777216,"sheet_cells":100000,"rows_first":2000,"rows_last":500,"rows_between":2000,"halvings":0,"cell_chars":16384,"cell_head_chars":4096},"cells_cut":0,"cells_raw":0,"read":"whole","date_system":"1900"}

{"sheet":"Титульный лист","index":0,"n_rows":24,"n_cols":8,"rows_kept":24,"cut":false,"hidden":false,"merged":[[15,1,16,1],[23,1,27,9],[1,5,1,9],[15,2,16,9],[12,7,13,7],[12,8,13,8],[12,2,13,6],[4,4,4,5],[4,7,4,8],[8,2,8,8],[6,2,6,8],[10,2,10,3]]}
[]
[null,null,null,null,"GUID:"]
[]
[]
[null,"Карточка наблюдений №",null,null,null,null,"от "]
[]
[null,"Страна"]
[]
[null,"Регион:"]
[]
[null,"Погода:",null,null,"  Температура:"]
[]
[null,"Маршрут: ",null,null,null,null,null,"Длина маршрута:"]
[]
[]
[null,"Комментарий: "]
[]
[]
[]
[]
[]
[]
[]
[null,"Инструкция: GUID необходимо получить в БД \"Онлайн дневники наблюдений\". Для этого на рабочем столе нажмите в левом верхнем углу БД ссылку \"Настройки пользователя\", в настройках нажать кнопку \"Получить GUID\". Если поле \"GUID обмена пустое\", то необходимо сформировать новый GUID. Результат необходимо скопировать и поместить в поле GUID данного титульного листа.\nВ  поле номера (\"Карточка наблюдений №\") необходимо каждый раз вручную указывать уникальный в пределах дня номер наблюдений. Например, если Вы хотите сформировать за день две карточки, то для них нужно отдельно указать №1, а после выгрузки первой карточки - №2. После отправки на сервер номер очищается. Повторная выгрузка с тем же номером и датой карточки перезапишет карточку на сервере."]

{"sheet":"Таблица наблюдений","index":1,"n_rows":158,"n_cols":6,"rows_kept":158,"cut":false,"hidden":false,"merged":[]}
[null,"Вид птицы","Количество","Примечание","GPS","Биотоп"]
[{"$f":"VLOOKUP(B2,'Список птиц'!A2:B916, 2, FALSE)","v":{"$error":"#N/A"}}]
[{"$f":"VLOOKUP(B3,'Список птиц'!A3:B917, 2, FALSE)","v":{"$error":"#N/A"}}]
[{"$f":"VLOOKUP(B4,'Список птиц'!A4:B918, 2, FALSE)","v":{"$error":"#N/A"}}]
[{"$f":"VLOOKUP(B5,'Список птиц'!A5:B919, 2, FALSE)","v":{"$error":"#N/A"}}]
[{"$f":"VLOOKUP(B6,'Список птиц'!A6:B920, 2, FALSE)","v":{"$error":"#N/A"}}]
[{"$f":"VLOOKUP(B7,'Список птиц'!A7:B921, 2, FALSE)","v":{"$error":"#N/A"}}]
[{"$f":"VLOOKUP(B8,'Список птиц'!A8:B922, 2, FALSE)","v":{"$error":"#N/A"}}]
[{"$f":"VLOOKUP(B9,'Список птиц'!A9:B923, 2, FALSE)","v":{"$error":"#N/A"}}]
[{"$f":"VLOOKUP(B10,'Список птиц'!A10:B924, 2, FALSE)","v":{"$error":"#N/A"}}]
[{"$f":"VLOOKUP(B11,'Список птиц'!A11:B925, 2, FALSE)","v":{"$error":"#N/A"}}]
[{"$f":"VLOOKUP(B12,'Список птиц'!A12:B926, 2, FALSE)","v":{"$error":"#N/A"}}]
[{"$f":"VLOOKUP(B13,'Список птиц'!A13:B927, 2, FALSE)","v":{"$error":"#N/A"}}]
[{"$f":"VLOOKUP(B14,'Список птиц'!A14:B928, 2, FALSE)","v":{"$error":"#N/A"}}]
[{"$f":"VLOOKUP(B15,'Список птиц'!A15:B929, 2, FALSE)","v":{"$error":"#N/A"}}]
[{"$f":"VLOOKUP(B16,'Список птиц'!A16:B930, 2, FALSE)","v":{"$error":"#N/A"}}]
[{"$f":"VLOOKUP(B17,'Список птиц'!A17:B931, 2, FALSE)","v":{"$error":"#N/A"}}]
[{"$f":"VLOOKUP(B18,'Список птиц'!A18:B932, 2, FALSE)","v":{"$error":"#N/A"}}]
[{"$f":"VLOOKUP(B19,'Список птиц'!A19:B933, 2, FALSE)","v":{"$error":"#N/A"}}]
[{"$f":"VLOOKUP(B20,'Список птиц'!A20:B934, 2, FALSE)","v":{"$error":"#N/A"}}]
[{"$f":"VLOOKUP(B21,'Список птиц'!A21:B935, 2, FALSE)","v":{"$error":"#N/A"}}]
[{"$f":"VLOOKUP(B22,'Список птиц'!A22:B936, 2, FALSE)","v":{"$error":"#N/A"}}]
[{"$f":"VLOOKUP(B23,'Список птиц'!A23:B937, 2, FALSE)","v":{"$error":"#N/A"}}]
[{"$f":"VLOOKUP(B24,'Список птиц'!A24:B938, 2, FALSE)","v":{"$error":"#N/A"}}]
[{"$f":"VLOOKUP(B25,'Список птиц'!A25:B939, 2, FALSE)","v":{"$error":"#N/A"}}]
[{"$f":"VLOOKUP(B26,'Список птиц'!A26:B940, 2, FALSE)","v":{"$error":"#N/A"}}]
[{"$f":"VLOOKUP(B27,'Список птиц'!A27:B941, 2, FALSE)","v":{"$error":"#N/A"}}]
[{"$f":"VLOOKUP(B28,'Список птиц'!A28:B942, 2, FALSE)","v":{"$error":"#N/A"}}]
[{"$f":"VLOOKUP(B29,'Список птиц'!A29:B943, 2, FALSE)","v":{"$error":"#N/A"}}]
[{"$f":"VLOOKUP(B30,'Список птиц'!A30:B944, 2, FALSE)","v":{"$error":"#N/A"}}]
[{"$f":"VLOOKUP(B31,'Список птиц'!A31:B945, 2, FALSE)","v":{"$error":"#N/A"}}]
[{"$f":"VLOOKUP(B32,'Список птиц'!A32:B946, 2, FALSE)","v":{"$error":"#N/A"}}]
[{"$f":"VLOOKUP(B33,'Список птиц'!A33:B947, 2, FALSE)","v":{"$error":"#N/A"}}]
[{"$f":"VLOOKUP(B34,'Список птиц'!A34:B948, 2, FALSE)","v":{"$error":"#N/A"}}]
[{"$f":"VLOOKUP(B35,'Список птиц'!A35:B949, 2, FALSE)","v":{"$error":"#N/A"}}]
[{"$f":"VLOOKUP(B36,'Список птиц'!A36:B950, 2, FALSE)","v":{"$error":"#N/A"}}]
[{"$f":"VLOOKUP(B37,'Список птиц'!A37:B951, 2, FALSE)","v":{"$error":"#N/A"}}]
[{"$f":"VLOOKUP(B38,'Список птиц'!A38:B952, 2, FALSE)","v":{"$error":"#N/A"}}]
[{"$f":"VLOOKUP(B39,'Список птиц'!A39:B953, 2, FALSE)","v":{"$error":"#N/A"}}]
[{"$f":"VLOOKUP(B40,'Список птиц'!A40:B954, 2, FALSE)","v":{"$error":"#N/A"}}]
[{"$f":"VLOOKUP(B41,'Список птиц'!A41:B955, 2, FALSE)","v":{"$error":"#N/A"}}]
[{"$f":"VLOOKUP(B42,'Список птиц'!A42:B956, 2, FALSE)","v":{"$error":"#N/A"}}]
[{"$f":"VLOOKUP(B43,'Список птиц'!A43:B957, 2, FALSE)","v":{"$error":"#N/A"}}]
[{"$f":"VLOOKUP(B44,'Список птиц'!A44:B958, 2, FALSE)","v":{"$error":"#N/A"}}]
[{"$f":"VLOOKUP(B45,'Список птиц'!A45:B959, 2, FALSE)","v":{"$error":"#N/A"}}]
[{"$f":"VLOOKUP(B46,'Список птиц'!A46:B960, 2, FALSE)","v":{"$error":"#N/A"}}]
[{"$f":"VLOOKUP(B47,'Список птиц'!A47:B961, 2, FALSE)","v":{"$error":"#N/A"}}]
[{"$f":"VLOOKUP(B48,'Список птиц'!A48:B962, 2, FALSE)","v":{"$error":"#N/A"}}]
[{"$f":"VLOOKUP(B49,'Список птиц'!A49:B963, 2, FALSE)","v":{"$error":"#N/A"}}]
[{"$f":"VLOOKUP(B50,'Список птиц'!A50:B964, 2, FALSE)","v":{"$error":"#N/A"}}]
[{"$f":"VLOOKUP(B51,'Список птиц'!A51:B965, 2, FALSE)","v":{"$error":"#N/A"}}]
[{"$f":"VLOOKUP(B52,'Список птиц'!A52:B966, 2, FALSE)","v":{"$error":"#N/A"}}]
[{"$f":"VLOOKUP(B53,'Список птиц'!A53:B967, 2, FALSE)","v":{"$error":"#N/A"}}]
[{"$f":"VLOOKUP(B54,'Список птиц'!A54:B968, 2, FALSE)","v":{"$error":"#N/A"}}]
[{"$f":"VLOOKUP(B55,'Список птиц'!A55:B969, 2, FALSE)","v":{"$error":"#N/A"}}]
[{"$f":"VLOOKUP(B56,'Список птиц'!A56:B970, 2, FALSE)","v":{"$error":"#N/A"}}]
[{"$f":"VLOOKUP(B57,'Список птиц'!A57:B971, 2, FALSE)","v":{"$error":"#N/A"}}]
[{"$f":"VLOOKUP(B58,'Список птиц'!A58:B972, 2, FALSE)","v":{"$error":"#N/A"}}]
[{"$f":"VLOOKUP(B59,'Список птиц'!A59:B973, 2, FALSE)","v":{"$error":"#N/A"}}]
[{"$f":"VLOOKUP(B60,'Список птиц'!A60:B974, 2, FALSE)","v":{"$error":"#N/A"}}]
[{"$f":"VLOOKUP(B61,'Список птиц'!A61:B975, 2, FALSE)","v":{"$error":"#N/A"}}]
[{"$f":"VLOOKUP(B62,'Список птиц'!A62:B976, 2, FALSE)","v":{"$error":"#N/A"}}]
[{"$f":"VLOOKUP(B63,'Список птиц'!A63:B977, 2, FALSE)","v":{"$error":"#N/A"}}]
[{"$f":"VLOOKUP(B64,'Список птиц'!A64:B978, 2, FALSE)","v":{"$error":"#N/A"}}]
[{"$f":"VLOOKUP(B65,'Список птиц'!A65:B979, 2, FALSE)","v":{"$error":"#N/A"}}]
[{"$f":"VLOOKUP(B66,'Список птиц'!A66:B980, 2, FALSE)","v":{"$error":"#N/A"}}]
[{"$f":"VLOOKUP(B67,'Список птиц'!A67:B981, 2, FALSE)","v":{"$error":"#N/A"}}]
[{"$f":"VLOOKUP(B68,'Список птиц'!A68:B982, 2, FALSE)","v":{"$error":"#N/A"}}]
[{"$f":"VLOOKUP(B69,'Список птиц'!A69:B983, 2, FALSE)","v":{"$error":"#N/A"}}]
[{"$f":"VLOOKUP(B70,'Список птиц'!A70:B984, 2, FALSE)","v":{"$error":"#N/A"}}]
[{"$f":"VLOOKUP(B71,'Список птиц'!A71:B985, 2, FALSE)","v":{"$error":"#N/A"}}]
[{"$f":"VLOOKUP(B72,'Список птиц'!A72:B986, 2, FALSE)","v":{"$error":"#N/A"}}]
[{"$f":"VLOOKUP(B73,'Список птиц'!A73:B987, 2, FALSE)","v":{"$error":"#N/A"}}]
[{"$f":"VLOOKUP(B74,'Список птиц'!A74:B988, 2, FALSE)","v":{"$error":"#N/A"}}]
[{"$f":"VLOOKUP(B75,'Список птиц'!A75:B989, 2, FALSE)","v":{"$error":"#N/A"}}]
[{"$f":"VLOOKUP(B76,'Список птиц'!A76:B990, 2, FALSE)","v":{"$error":"#N/A"}}]
[{"$f":"VLOOKUP(B77,'Список птиц'!A77:B991, 2, FALSE)","v":{"$error":"#N/A"}}]
[{"$f":"VLOOKUP(B78,'Список птиц'!A78:B992, 2, FALSE)","v":{"$error":"#N/A"}}]
[{"$f":"VLOOKUP(B79,'Список птиц'!A79:B993, 2, FALSE)","v":{"$error":"#N/A"}}]
[{"$f":"VLOOKUP(B80,'Список птиц'!A80:B994, 2, FALSE)","v":{"$error":"#N/A"}}]
[{"$f":"VLOOKUP(B81,'Список птиц'!A81:B995, 2, FALSE)","v":{"$error":"#N/A"}}]
[{"$f":"VLOOKUP(B82,'Список птиц'!A82:B996, 2, FALSE)","v":{"$error":"#N/A"}}]
[{"$f":"VLOOKUP(B83,'Список птиц'!A83:B997, 2, FALSE)","v":{"$error":"#N/A"}}]
[{"$f":"VLOOKUP(B84,'Список птиц'!A84:B998, 2, FALSE)","v":{"$error":"#N/A"}}]
[{"$f":"VLOOKUP(B85,'Список птиц'!A85:B999, 2, FALSE)","v":{"$error":"#N/A"}}]
[{"$f":"VLOOKUP(B86,'Список птиц'!A86:B1000, 2, FALSE)","v":{"$error":"#N/A"}}]
[{"$f":"VLOOKUP(B87,'Список птиц'!A87:B1001, 2, FALSE)","v":{"$error":"#N/A"}}]
[{"$f":"VLOOKUP(B88,'Список птиц'!A88:B1002, 2, FALSE)","v":{"$error":"#N/A"}}]
[{"$f":"VLOOKUP(B89,'Список птиц'!A89:B1003, 2, FALSE)","v":{"$error":"#N/A"}}]
[{"$f":"VLOOKUP(B90,'Список птиц'!A90:B1004, 2, FALSE)","v":{"$error":"#N/A"}}]
[{"$f":"VLOOKUP(B91,'Список птиц'!A91:B1005, 2, FALSE)","v":{"$error":"#N/A"}}]
[{"$f":"VLOOKUP(B92,'Список птиц'!A92:B1006, 2, FALSE)","v":{"$error":"#N/A"}}]
[{"$f":"VLOOKUP(B93,'Список птиц'!A93:B1007, 2, FALSE)","v":{"$error":"#N/A"}}]
[{"$f":"VLOOKUP(B94,'Список птиц'!A94:B1008, 2, FALSE)","v":{"$error":"#N/A"}}]
[{"$f":"VLOOKUP(B95,'Список птиц'!A95:B1009, 2, FALSE)","v":{"$error":"#N/A"}}]
[{"$f":"VLOOKUP(B96,'Список птиц'!A96:B1010, 2, FALSE)","v":{"$error":"#N/A"}}]
[{"$f":"VLOOKUP(B97,'Список птиц'!A97:B1011, 2, FALSE)","v":{"$error":"#N/A"}}]
[{"$f":"VLOOKUP(B98,'Список птиц'!A98:B1012, 2, FALSE)","v":{"$error":"#N/A"}}]
[{"$f":"VLOOKUP(B99,'Список птиц'!A99:B1013, 2, FALSE)","v":{"$error":"#N/A"}}]
[{"$f":"VLOOKUP(B100,'Список птиц'!A100:B1014, 2, FALSE)","v":{"$error":"#N/A"}}]
[{"$f":"VLOOKUP(B101,'Список птиц'!A101:B1015, 2, FALSE)","v":{"$error":"#N/A"}}]
[{"$f":"VLOOKUP(B102,'Список птиц'!A102:B1016, 2, FALSE)","v":{"$error":"#N/A"}}]
[{"$f":"VLOOKUP(B103,'Список птиц'!A103:B1017, 2, FALSE)","v":{"$error":"#N/A"}}]
[{"$f":"VLOOKUP(B104,'Список птиц'!A104:B1018, 2, FALSE)","v":{"$error":"#N/A"}}]
[{"$f":"VLOOKUP(B105,'Список птиц'!A105:B1019, 2, FALSE)","v":{"$error":"#N/A"}}]
[{"$f":"VLOOKUP(B106,'Список птиц'!A106:B1020, 2, FALSE)","v":{"$error":"#N/A"}}]
[{"$f":"VLOOKUP(B107,'Список птиц'!A107:B1021, 2, FALSE)","v":{"$error":"#N/A"}}]
[{"$f":"VLOOKUP(B108,'Список птиц'!A108:B1022, 2, FALSE)","v":{"$error":"#N/A"}}]
[{"$f":"VLOOKUP(B109,'Список птиц'!A109:B1023, 2, FALSE)","v":{"$error":"#N/A"}}]
[{"$f":"VLOOKUP(B110,'Список птиц'!A110:B1024, 2, FALSE)","v":{"$error":"#N/A"}}]
[{"$f":"VLOOKUP(B111,'Список птиц'!A111:B1025, 2, FALSE)","v":{"$error":"#N/A"}}]
[{"$f":"VLOOKUP(B112,'Список птиц'!A112:B1026, 2, FALSE)","v":{"$error":"#N/A"}}]
[{"$f":"VLOOKUP(B113,'Список птиц'!A113:B1027, 2, FALSE)","v":{"$error":"#N/A"}}]
[{"$f":"VLOOKUP(B114,'Список птиц'!A114:B1028, 2, FALSE)","v":{"$error":"#N/A"}}]
[{"$f":"VLOOKUP(B115,'Список птиц'!A115:B1029, 2, FALSE)","v":{"$error":"#N/A"}}]
[{"$f":"VLOOKUP(B116,'Список птиц'!A116:B1030, 2, FALSE)","v":{"$error":"#N/A"}}]
[{"$f":"VLOOKUP(B117,'Список птиц'!A117:B1031, 2, FALSE)","v":{"$error":"#N/A"}}]
[{"$f":"VLOOKUP(B118,'Список птиц'!A118:B1032, 2, FALSE)","v":{"$error":"#N/A"}}]
[{"$f":"VLOOKUP(B119,'Список птиц'!A119:B1033, 2, FALSE)","v":{"$error":"#N/A"}}]
[{"$f":"VLOOKUP(B120,'Список птиц'!A120:B1034, 2, FALSE)","v":{"$error":"#N/A"}}]
{"$rows_left_out":39}
{"sheet":"Список птиц","index":2,"n_rows":916,"n_cols":2,"rows_kept":916,"cut":false,"hidden":true,"merged":[]}
["Наименование"]
["Авдотка (Burhinus oedicnemus)","5498bfd667"]
["Аист белый (Ciconia ciconia)","d1ac31392e"]
["Аист дальневосточный (Ciconia boyciana)","1095b10807"]
["Аист черный (Ciconia nigra)","e6d82f0dd3"]
["Альбатроc чернобровый (Thalassarche melanophris)","a0f7f79c74"]
["Альбатрос белоспинный (Phoebastria albatrus)","8c37ea3143"]
["Альбатрос темноспинный (Phoebastria immutabilis)","7dd7f8a198"]
["Альбатрос черноногий (Phoebastria nigripes)","6c657cec62"]
["Баклан берингов (Phalacrocorax pelagicus)","c8d76e9054"]
["Баклан большой (Phalacrocorax carbo)","8b6d0d68df"]
["Баклан краснолицый (Phalacrocorax urile)","386bf140b4"]
["Баклан малый (Phalacrocorax pygmeus)","f914feeee5"]
["Баклан стеллеров (Phalacrocorax perspicillatus)","5b49a2f9b2"]
["Баклан уссурийский (Phalacrocorax capillatus)","a4ef90271d"]
["Баклан ушастый (Phalacrocorax auritus)","36d9f0a433"]
["Баклан хохлатый (Phalacrocorax aristotelis)","98e1049c90"]
["Балобан (Falco cherrug)","e9aa8ad3d4"]
["Бегунок обыкновенный (Cursorius cursor)","bf867b3987"]
["Бекас азиатский (Gallinago stenura)","b82228e05e"]
["Бекас американский (Gallinago delicata)","4972d70ee4"]
["Бекас обыкновенный (Gallinago gallinago)","edd6877b34"]
["Бекас цветной (Rostratula benghalensis)","2c6dbf5c9d"]
["Бекас японский (Gallinago hardwickii)","16bc396ecd"]
["Белобровик (Turdus iliacus)","c7e1053531"]
["Белобрюшка (Aethia psittacula)","93d81acc35"]
["Белоглазка буробокая (Zosterops erythropleurus)","d57b508e87"]
["Белоглазка японская (Zosterops japonicus)","e635afdacd"]
["Белоножка (Enicurus scouleri)","cc8d912702"]
["Береговушка (Riparia riparia)","624fded293"]
["Береговушка бледная (Riparia diluta)","3516325c06"]
["Береговушка малая (Riparia chinensis)","298026b1da"]
["Беркут (Aquila chrysaetos)","201cce499d"]
["Бормотушка северная (Iduna caligata)","119dd7f5ea"]
["Бормотушка южная (Iduna rama)","7ca4357978"]
["Бородач (Gypaetus barbatus)","af7927d829"]
["Бургомистр (Larus hyperboreus)","6e39a049e8"]
["Буревестник балеарский (Puffinus mauretanicus)","0dc6e38cbb"]
["Буревестник бледноногий (Puffinus carneipes)","6530da6465"]
["Буревестник большой пестробрюхий (Puffinus gravis)","4717c51e14"]
["Буревестник буллеров (Puffinus bulleri)","6c6d19604b"]
["Буревестник левантский (Puffinus yelkouan)","1ebf2bb7bc"]
["Буревестник малый (Puffinus puffinus)","6e41f0c429"]
["Буревестник пестролицый (Calonectris leucomelas)","9d3553614a"]
["Буревестник серый (Puffinus griseus)","746fc58200"]
["Буревестник средиземноморский (Calonectris diomedea)","1e09097d21"]
["Буревестник тонкоклювый (Puffinus tenuirostris)","3cf59fdacd"]
["Бюль-бюль белощекий (Pycnonotus leucogenys)","1a4d550905"]
["Бюль-бюль китайский (Pycnonotus sinensis)","87f8de8070"]
["Бюль-бюль короткопалый (Microscelis amaurotis)","0cc567fa00"]
["Бюль-бюль черный (Hypsipetes leucocephalus)","2e4e0bf4ea"]
["Вальдшнеп (Scolopax rusticola)","cd8302a9ea"]
["Варакушка (Luscinia svecica)","3c99d8126a"]
["Веретенник азиатский бекасовидный (Limnodromus semipalmatus)","3d3cb233cf"]
["Веретенник американский бекасовидный (Limnodromus scolopaceus)","460c7a77fe"]
["Веретенник большой (Limosa limosa)","9a165f9d50"]
["Веретенник малый (Limosa lapponica)","0ee2f176b0"]
["Вертишейка (Jynx torquilla)","ef1b21a20c"]
["Вильсония малая (Wilsonia pusilla)","ff8e1e573f"]
["Волчок (Ixobrychus minutus)","8d64cb2171"]
["Воробей афганский земляной (Pyrgilauda theresae)","a76740e5ce"]
["Воробей домовый (Passer domesticus)","712eb95720"]
["Воробей индийский (Passer indicus)","7f098c459a"]
["Воробей каменный (Petronia petronia)","92072028ec"]
["Воробей короткопалый (Carpospiza brachydactyla)","46ccac38f1"]
["Воробей монгольский земляной (Pyrgilauda davidiana)","d09c903e27"]
["Воробей полевой (Passer montanus)","4f0c2614c2"]
["Воробей пустынный (Passer zarudnyi)","f3abf28566"]
["Воробей рыжий (Passer rutilans)","9fdd5f5652"]
["Воробей саксаульный (Passer ammodendri)","ca69a31825"]
["Воробей снежный (Montifringilla nivalis)","07093c771d"]
["Воробей черногрудый (Passer hispaniolensis)","34f401ac36"]
["Ворон (Corvus corax)","b8ee91e9b0"]
["Ворон пустынный (Corvus ruficollis)","822686898e"]
["Ворона большеклювая (Corvus macrorhynchos)","fff274499d"]
["Ворона серая (Corvus cornix)","2075c7f33f"]
["Ворона черная (Corvus corone)","66282945b2"]
["Ворона черная восточная (Corvus orientalis)","3f2aae24d7"]
["Воронок восточный (Delichon dasypus)","fce7ee7d17"]
["Выпь амурская (Ixobrychus eurhythmus)","c5512ee597"]
["Выпь большая (Botaurus stellaris)","60ff7a5f78"]
["Выпь китайская (Ixobrychus sinensis)","723cdb16a8"]
["Выпь охристая (Ixobrychus cinnamomeus)","e43eed6409"]
["Выпь японская (Gorsachius goisagi)","7c207e8f33"]
["Вьюрок американский (Leucosticte tephrocotis)","23c3f2ee00"]
["Вьюрок буланый (Rhodospiza obsoleta)","d4665ff9bb"]
["Вьюрок гималайский (Leucosticte nemoricola)","7bcb4a710a"]
["Вьюрок жемчужный (Leucosticte brandti)","a8d0c5757e"]
["Вьюрок канареечный (Serinus serinus)","8d3159cfe3"]
["Вьюрок красношапочный (Serinus pusillus)","a0237bd30b"]
["Вьюрок красный (Carpodacus puniceus)","1d27ae5e25"]
["Вьюрок монгольский пустынный (Bucanetes mongolicus)","6146ca871d"]
["Вьюрок сибирский (Leucosticte arctoa)","accfb3ee69"]
["Вьюрок толстоклювый пустынный (Bucanetes githagineus)","c26e2e52fb"]
["Вяхирь обыкновенный (Columba palumbus)","8d2b35725c"]
["Вяхирь японский (Columba janthina)","9d4fc208ae"]
["Гага обыкновенная (Somateria mollissima)","ca639d2098"]
["Гага очковая (Somateria fischeri)","5d48d603c4"]
["Гага сибирская (Polysticta stelleri)","c27ddfbd05"]
["Гага-гребенушка (Somateria spectabilis)",5015445066]
["Гагара белоклювая (Gavia adamsii)","8994d85a28"]
["Гагара белошейная (Gavia pacifica)","9bd2032836"]
["Гагара краснозобая (Gavia stellata)","d53d63d6fb"]
["Гагара чернозобая (Gavia arctica)","f33f32ba92"]
["Гагара черноклювая (Gavia immer)","4d7baf916b"]
["Гагарка (Alca torda)","652c5397b1"]
["Гаичка гирканская (Parus hyrcanus)","5de5b1cecb"]
["Гаичка джунгарская (Parus songarus)","2985a3b339"]
["Гаичка сероголовая (Parus cinctus)","1b7a2a536a"]
["Гаичка средиземноморская (Parus lugubris)","5e35b519b5"]
["Гаичка черноголовая (Parus palustris)","d73ff5c9e9"]
["Галка (Corvus monedula)","00b1b243c9"]
["Галка альпийская (Pyrrhocorax graculus)","2271cae2d5"]
["Галка даурская (Corvus dauuricus)","773a1f3aca"]
["Галстучник обыкновенный (Charadrius hiaticula)","a616f8c015"]
["Галстучник перепончатопалый (Charadrius semipalmatus)","d3c540bf24"]
["Гаршнеп (Lymnocryptes minimus)","de00bbc065"]
["Глупыш (Fulmarus glacialis)","d37adaf747"]
["Глухарь (Tetrao urogallus)","93df259dac"]
["Глухарь каменный (Tetrao urogalloides)","93940eab1f"]
{"$rows_left_out":797}
{"sheet":"Регионы","index":3,"n_rows":79,"n_cols":4,"rows_kept":79,"cut":false,"hidden":true,"merged":[]}
[null,"Адыгея",null,"Винницкая область"]
[null,"Алтай республика",null,"Волынская область"]
[null,"Алтайский край",null,"Днепропетровская область"]
[null,"Амурская область",null,"Донецкая область"]
[null,"Архангельская область",null,"Житомирская область"]
[null,"Астраханская область",null,"Закарпатская область"]
[null,"Башкирия",null,"Запорожская область"]
[null,"Белгородская область",null,"Ивано-Франковская область"]
[null,"Брянская область",null,"Киевская область"]
[null,"Бурятия",null,"Кировоградская область"]
[null,"Владимирская область",null,"Крым"]
[null,"Волгоградская область",null,"Луганская область"]
[null,"Вологодская область",null,"Львовская область"]
[null,"Воронежская область",null,"Николаевская область"]
[null,"Дагестан",null,"Одесская область"]
[null,"Еврейская АО",null,"Полтавская область"]
[null,"Ивановская область",null,"Ровненская область"]
[null,"Ингушетия",null,"Сумская область"]
[null,"Иркутская область",null,"Тернопольская область"]
[null,"Кабардино-Балкария",null,"Харьковская область"]
[null,"Калининградская область",null,"Херсонская область"]
[null,"Калмыкия",null,"Хмельницкая область"]
[null,"Калужская область",null,"Черкасская область"]
[null,"Камчатский край",null,"Черниговская область"]
[null,"Карачаево-Черкессия",null,"Черновицкая область"]
[null,"Карелия"]
[null,"Кемеровская область"]
[null,"Кировская область"]
[null,"Коми"]
[null,"Костромская область"]
[null,"Краснодарский край"]
[null,"Красноярский край"]
[null,"Курганская область"]
[null,"Курская область"]
[null,"Ленинградская область"]
[null,"Липецкая область"]
[null,"Магаданская область"]
[null,"Марий Эл"]
[null,"Мордовия"]
[null,"Московская область"]
[null,"Мурманская область"]
[null,"Нижегородская область"]
[null,"Новгородская область"]
[null,"Новосибирская область"]
[null,"Омская область"]
[null,"Оренбургская область"]
[null,"Орловская область"]
[null,"Осетия Северная"]
[null,"Пензенская область"]
[null,"Пермский край"]
[null,"Приморский край"]
[null,"Псковская область"]
[null,"Ростовская область"]
[null,"Рязанская область"]
[null,"Самарская область"]
[null,"Саратовская область"]
[null,"Сахалин"]
[null,"Свердловская"]
[null,"Смоленская область"]
[null,"Ставропольский край"]
[null,"Тамбовская область"]
[null,"Татарстан"]
[null,"Тверская область"]
[null,"Томская область"]
[null,"Тульская область"]
[null,"Тыва"]
[null,"Тюменская область"]
[null,"Удмуртия"]
[null,"Ульяновская область"]
[null,"Хабаровский край"]
[null,"Хакассия"]
[null,"ХМАО"]
[null,"Челябинская область"]
[null,"Чечня"]
[null,"Читинская область"]
[null,"Чувашия"]
[null,"Чукотка"]
[null,"Якутия"]
[null,"Ярославская область"]

{"sheet":"Страны","index":4,"n_rows":14,"n_cols":2,"rows_kept":14,"cut":false,"hidden":true,"merged":[]}
[null,"Азербайджан"]
[null,"Армения"]
[null,"Беларусь"]
[null,"Грузия"]
[null,"Казахстан"]
[null,"Киргизия"]
[null,"Латвия"]
[null,"Литва"]
[null,"Россия"]
[null,"Таджикистан"]
[null,"Туркменистан"]
[null,"Узбекистан"]
[null,"Украина"]
[null,"Эстония"]

{"sheet":"Погода","index":5,"n_rows":5,"n_cols":2,"rows_kept":5,"cut":false,"hidden":true,"merged":[]}
[]
[null,"Пасмурно"]
[null,"Переменная облачность"]
[null,"Снег"]
[null,"Ясно"]

{"sheet":"Биотопы","index":6,"n_rows":45,"n_cols":1,"rows_kept":45,"cut":false,"hidden":true,"merged":[]}
["Наименование"]
["Альпийские луга"]
["Верховые болота"]
["Водораздельные луга"]
["Горы"]
["Заброшенные поля"]
["Заросли вечнозеленых кустарников"]
["Илистые и песчаные отмели"]
["Каменистые и ракушечные острова"]
["Каменистые осыпи, валуны"]
["Ленточные и колочные леса"]
["Лесные плантации"]
["Лесостепь"]
["Лесотундра"]
["Литораль"]
["Многолетние с/х культуры, сады"]
["Неизвестно"]
["Низовые болота"]
["Открытое море"]
["Отстойники, поля фильтрации"]
["Парки, сады"]
["Пашни, поля"]
["Переходные болота"]
["Песчаные дюны и пляжи"]
["Пойменные леса"]
["Пойменные луга"]
["Полупустыни"]
["Порослевые заросли"]
["Прибрежные лагуны"]
["Ракушечные и каменистые пляжи"]
["Реки и ручьи"]
["Сеянные луга"]
["Скалистые морские берега"]
["Смешанные леса"]
["Сплавины"]
["Степи"]
["Стоячие пресные водоемы"]
["Стоячие солоноватые и соленые водоемы"]
["Тундра"]
["Узкие морские заливы, фьорды"]
["Урбанизированные и индустриальные территории"]
["Хвойные леса"]
["Широколиственные вечнозеленые леса"]
["Широколиственные листопадные леса"]
[0]